{"text_format":"1","workbook":"xlsx","n_sheets":14,"sheets":["黒大豆メニュー","普及センター","気象情報","天気データ","園部2023","園部2022","須知2023","須知2022","本庄2023","本庄2022","美山2023","美山2022","三和2023","三和2022"],"not_rendered":{"charts":4,"images":54,"macros":1,"external_links":0,"defined_names":54,"comments":0,"pivot_tables":0},"unopened":[],"bounds":{"document_bytes":16777216,"sheet_cells":100000,"rows_first":2000,"rows_last":500,"rows_between":2000,"halvings":0,"cell_chars":16384,"cell_head_chars":4096},"cells_cut":0,"cells_raw":0,"read":"whole","date_system":"1900"}

{"sheet":"黒大豆メニュー","index":0,"n_rows":33,"n_cols":18,"rows_kept":33,"cut":false,"hidden":false,"merged":[[23,8,24,8],[0,3,1,5],[11,10,11,14],[14,10,14,14],[16,10,16,12],[18,12,19,14],[0,12,1,14],[0,7,2,10],[18,3,19,5],[23,3,24,3],[23,4,24,4],[23,5,24,5],[23,6,24,6],[23,7,24,7],[22,12,23,14],[24,12,25,14],[22,15,23,17],[24,15,25,17],[26,12,27,14],[26,15,27,17],[30,15,30,17],[28,12,28,14],[29,12,29,14],[28,15,28,17],[29,15,29,17]]}
[null,null,null,"排水対策診断",null,null,null,"黒大豆　総合メニュー",null,null,null,null,"気 象 情 報"]
[]
[null,null,null,null,null,null,null,null,null,null,null,null,null,null,null,null,null,"4月"]
[]
[]
[]
[]
[]
[]
[null,"Ver.",230323]
[null,null,null,null,null,null,null,null,null,null,"気象庁ホームページへ"]
[null,null,null,null,null,null,null,null,null,null,"気象庁 Japan Meteorological Agency (jma.go.jp)"]
[]
[null,null,null,null,null,null,null,null,null,null,"雨雲ナウキャスト"]
[null,null,null,"これまでにシステムで保存したファイル",null,null,null,null,null,null,"気象庁 | ナウキャスト（雨雲の動き・雷・竜巻） (jma.go.jp)"]
[null,null,null,null,null,null,null,null,null,null,"警報・注意報（移動先画面で市町村選択）"]
[null,null,null,null,null,null,null,null,null,null,"気象庁 | 警報・注意報 (jma.go.jp)"]
[]
[null,null,null,"土寄せ作業適期判断",null,null,null,null,null,null,null,null,"普及センターの情報"]
[]
[]
[null,null,null,"前回の入力値",null,null,null,null,null,null,null,null,"黒大豆ページ技術情報",null,{"$f":"IF(普及センター!D5=\"\",\"\",普及センター!D5)","v":""},"普及センターHP新着情報",null,{"$f":"IF(普及センター!$G$6=\"\",\"\",普及センター!$G$6)","v":""}]
[null,null,null,"播種日","定植日","土寄せ①","土寄せ②","茎葉除草剤","摘　心",null,null,null,{"$f":"IF(普及センター!$D$7=\"\",\"\",普及センター!$D$7)","v":""},null,null,{"$f":"IF(普及センター!$G$7=\"\",\"\",普及センター!$G$7)","v":""}]
[]
[null,null,null,null,null,null,null,null,null,null,null,null,{"$f":"IF(普及センター!$D$9=\"\",\"\",普及センター!$D$9)","v":""},null,null,{"$f":"IF(普及センター!$G$9=\"\",\"\",普及センター!$G$9)","v":""}]
[null,"Ver.",230323]
[null,null,null,"これまでにシステムで保存したファイル",null,null,null,null,null,null,null,null,{"$f":"IF(普及センター!$D$11=\"\",\"\",普及センター!$D$11)","v":""},null,null,{"$f":"IF(普及センター!$G$11=\"\",\"\",普及センター!$G$11)","v":""}]
[]
[null,null,null,null,null,null,null,null,null,null,null,null,{"$f":"IF(普及センター!$D$13=\"\",\"\",\"ほ　か\")","v":""},null,null,{"$f":"IF(普及センター!$G$13=\"\",\"\",\"ほ　か\")","v":""}]
[]
{"$rows_left_out":4}
{"sheet":"普及センター","index":1,"n_rows":5,"n_cols":7,"rows_kept":5,"cut":false,"hidden":false,"merged":[[18,6,19,10],[20,6,21,10],[22,6,23,10],[6,6,7,10],[8,6,9,10],[10,6,11,10],[12,6,13,10],[14,6,15,10],[16,6,17,10],[0,0,1,1],[22,3,23,3],[6,3,7,3],[8,3,9,3],[10,3,11,3],[12,3,13,3],[14,3,15,3],[16,3,17,3],[18,3,19,3],[20,3,21,3]]}
["普及センターの情報"]
[]
[]
[null,null,null,"黒大豆ページの技術情報ファイル一覧",null,null,"普及センターホームページ　新着情報　（タイトルのみ表示）"]
[null,null,null,null,null,null,"（記事を読む場合は画面左（親ページ）を開くボタン）"]

{"sheet":"気象情報","index":2,"n_rows":15,"n_cols":20,"rows_kept":15,"cut":false,"hidden":false,"merged":[[0,0,1,2],[6,6,6,8],[1,6,5,6],[1,7,2,8],[3,7,4,8],[5,7,5,8],[0,6,0,8],[2,1,3,2],[5,3,6,5],[10,6,11,7],[12,6,12,7],[12,10,12,11],[12,13,12,14],[7,6,9,6],[7,7,8,8],[9,7,9,8],[0,9,0,12],[0,13,0,16],[1,10,2,12],[1,14,2,16],[1,9,2,9],[1,13,2,13]]}
["気象情報ページ\n気象庁ホームページより",null,null,230413,null,null,{"$f":"TEXT(天気データ!B19,\"yy/mm/dd\") & \"  \"&TEXT(天気データ!B18,\"#\")&\":00発表\"","v":"23/04/13  11:00発表"},null,null,{"$f":"IF(天気データ!B18=17,\"今夜\",\"今日\")","v":"今日"},null,null,null,"明日"]
[null,null,null,null,"京都地方気象台",null,"南部","天気",null,null,{"$f":"天気データ!B10","v":"晴れ"},null,null,null,{"$f":"天気データ!C10","v":"晴れ　夕方　から　くもり"},null,null,null,null,"降水確率今日明日"]
[null,null,null,null,null,null,null,null,null,null,null,null,null,null,null,null,null,null,null,"18,0,6,12,18"]
[null,null,null,null,null,null,null,"降水確率",null,"00-06","06-12","12-18","18-24","00-06","06-12","12-18","18-24",null,null,"12,18,0,6,12,18"]
[null,null,null,null,null,null,null,null,null,"-",{"$f":"IF(天気データ!C13=\"\",\"-\",天気データ!C13)","v":"-"},{"$f":"IF(天気データ!D13=\"\",\"-\",天気データ!D13)","v":0},{"$f":"IF(天気データ!E13=\"\",\"-\",天気データ!E13)","v":0},{"$f":"IF(天気データ!F13=\"\",\"-\",天気データ!F13)","v":0},{"$f":"IF(天気データ!G13=\"\",\"-\",天気データ!G13)","v":0},{"$f":"IF(天気データ!H13=\"\",\"-\",天気データ!H13)","v":0},{"$f":"IF(天気データ!I13=\"\",\"-\",天気データ!I13)","v":20}]
[null,null,null,null,null,null,null,"京都気温 ℃",null,"朝最低","-","日中最高",{"$f":"IF(天気データ!C15=\"\",\"-\",天気データ!C15)","v":23},"朝最低",{"$f":"IF(天気データ!D15=\"\",\"-\",天気データ!D15)","v":9},"日中最高",{"$f":"IF(天気データ!E15=\"\",\"-\",天気データ!E15)","v":24}]
[null,null,null,null,null,null,"週間天気予報",null,null,{"$f":"IF(天気データ!B18=17,\"今夜（\",\"今日（\") & MID(TEXT(天気データ!B19,\"yyyy/m/d\"),6,5) & \"）\"","v":"今日（4/13）"},{"$f":"天気データ!B19+1","v":"2023-04-14"},{"$f":"天気データ!B19+2","v":"2023-04-15"},{"$f":"天気データ!B19+3","v":"2023-04-16"},{"$f":"天気データ!B19+4","v":"2023-04-17"},{"$f":"天気データ!B19+5","v":"2023-04-18"},{"$f":"天気データ!B19+6","v":"2023-04-19"},{"$f":"IF(Q9=\"-\",\"-\",天気データ!B19+7)","v":"2023-04-20"}]
[null,"気温、降水量のグラフ",null,null,null,null,"南部","天気"]
[null,"アメダス地点",null,"年","月",null,null,null,null,{"$f":"HLOOKUP(天気データ!B$9,天気データ!$B$3:$AY$4,2,FALSE)","v":"晴"},{"$f":"HLOOKUP(天気データ!C$9,天気データ!$B$3:$AY$4,2,FALSE)","v":"晴後曇"},{"$f":"HLOOKUP(天気データ!L$9,天気データ!$B$3:$AY$4,2,FALSE)","v":"雨時々止む"},{"$f":"HLOOKUP(天気データ!M$9,天気データ!$B$3:$AY$4,2,FALSE)","v":"曇時々晴"},{"$f":"HLOOKUP(天気データ!N$9,天気データ!$B$3:$AY$4,2,FALSE)","v":"晴時々曇"},{"$f":"HLOOKUP(天気データ!O$9,天気データ!$B$3:$AY$4,2,FALSE)","v":"曇時々晴"},{"$f":"HLOOKUP(天気データ!P$9,天気データ!$B$3:$AY$4,2,FALSE)","v":"曇"},{"$f":"IF(天気データ!Q$9=\"\",\"-\",HLOOKUP(天気データ!Q$9,天気データ!$B$3:$AY$4,2,FALSE))","v":"曇時々晴"}]
[null,{"$f":"VLOOKUP(天気データ!B30,天気データ!B31:C35,2,FALSE)","v":"園部"},null,{"$f":"VLOOKUP(天気データ!F30,天気データ!F31:G34,2,FALSE)","v":2023},{"$f":"VLOOKUP(天気データ!H30,天気データ!H31:I42,2,FALSE)","v":"04"},null,null,"降水確率 %",null,{"$f":"MAX(K5:M5)","v":0},{"$f":"MAX(N5:Q5)","v":20},{"$f":"天気データ!L11","v":90},{"$f":"天気データ!M11","v":30},{"$f":"天気データ!N11","v":20},{"$f":"天気データ!O11","v":30},{"$f":"天気データ!P11","v":40},{"$f":"IF(天気データ!Q11=\"\",\"-\",天気データ!Q11)","v":30}]
[null,null,null,null,null,null,"京　 都\n気温 ℃",null,"最高",{"$f":"IF(天気データ!C15=\"\",\"-\",天気データ!C15)","v":23},{"$f":"天気データ!E15","v":24},{"$f":"天気データ!L13","v":21},{"$f":"天気データ!M13","v":21},{"$f":"天気データ!N13","v":21},{"$f":"天気データ!O13","v":24},{"$f":"天気データ!P13","v":25},{"$f":"IF(天気データ!Q13=\"\",\"-\",天気データ!Q13)","v":25}]
[null,null,null,null,null,null,null,null,"最低","-",{"$f":"天気データ!D15","v":9},{"$f":"天気データ!L14","v":14},{"$f":"天気データ!M14","v":12},{"$f":"天気データ!N14","v":10},{"$f":"天気データ!O14","v":11},{"$f":"天気データ!P14","v":14},{"$f":"IF(天気データ!Q14=\"\",\"-\",天気データ!Q14)","v":14}]
[null,null,null,null,null,null,"平年値",null,"京都","最低気温℃",{"$f":"天気データ!K15","v":9.6},null,"最高気温℃",{"$f":"天気データ!L15","v":20.5},null,"7日計降水量",{"$f":"TEXT(天気データ!N15,\"#\") & \" - \"&TEXT(天気データ!O15,\"#\")&\" mm\"","v":"14 - 34 mm"}]
[]
["気温(平均、最高、最低) ℃",null,null,"3月",null,null,null,null,null,"4月","降水量(日合計) mm",null,null,"3月",null,null,"4月"]

{"sheet":"天気データ","index":3,"n_rows":42,"n_cols":50,"rows_kept":42,"cut":false,"hidden":true,"merged":[]}
[null,"図100","図5100","図101","図5101","図102","図103",104,"図110","図5110","図111","図5111","図112","図114","図200","図201","図5201","図202","図203","図204","図205","図206","図207","図210","図5210","図211","図5211","図212","図214","図215","図216","図218",null,"図260","図270","図281","図300","図302","図311","図313","図340","図371","図400",null,"図402","図406","図411","図413",null,"消去"]
[]
[null,100,5100,101,5101,102,103,null,110,5110,111,5111,112,114,200,201,5201,202,203,204,205,206,207,210,5210,211,5211,212,214,215,216,218,null,260,270,281,300,302,311,313,340,371,400,null,402,406,411,413]
[null,"晴","(夜)晴","晴時々曇","(夜)晴時々曇","晴一時雨","晴時々雨",null,"晴後時々曇","(夜)晴後時々曇","晴後曇","(夜)晴後曇","晴後一時雨","晴後雨","曇","曇時々晴","(夜)曇時々晴","曇一時雨","曇時々雨","曇一時雪","曇時々雪","曇一時雨か雪","曇時々雨か雪","曇後時々晴","(夜)曇後時々晴","曇後晴","(夜)曇後晴","曇後一時雨","曇後雨","曇後一時雪","曇後時々雪","曇後雨か雪",null,"曇一時雪か雨","曇時々雪か雨","曇後雪か雨","雨","雨時々止む","雨後晴","雨後曇","雪か雨","雪か雨後曇","雪",null,"雪時々止む","風雪強い","風雪強い","雪後曇"]
[null,5,null,5,null,null,null,null,5,null,5,null,5,5,null,5,null,null,null,null,null,null,null,5,null,5,null,null,null,null,null,null,null,null,null,null,null,null,null,null,null,null,null,null,null,null,5]
[null,null,40,"気象庁データ読込みに\n10秒ほどかかります",40,20,20,40,40]
[]
[null,{"$f":"IF(AND($B$18=17,HLOOKUP(B9,天気データ!$B$3:$AX$5,3,FALSE)=5),\"図\" & \"5\" & B9,\"図\" & B9)","v":"図100"},{"$f":"\"図\" & C9","v":"図111"},{"$f":"\"図\" & D9","v":"図302"},null,null,null,null,null,null,0,{"$f":"\"図\" & L9","v":"図302"},{"$f":"\"図\" & M9","v":"図201"},{"$f":"\"図\" & N9","v":"図101"},{"$f":"\"図\" & O9","v":"図201"},{"$f":"\"図\" & P9","v":"図200"},{"$f":"IF(Q9=\"\",\"消去\",\"図\" & Q9)","v":"図201"},7]
["tenkicd",100,111,302,null,null,null,null,null,"wtenkicd",null,302,201,101,201,200,201]
["tenkiwd","晴れ","晴れ　夕方　から　くもり","雨　時々　くもり"]
["kaze","南の風","東の風　後　西の風","南東の風　後　南西の風",null,null,null,null,null,"wkousui",null,90,30,20,30,40,30]
[null,null,null,null,null,null,null,null,null,"wsinrai",null,null,"B","A","A","B","B"]
["kousui",null,null,0,0,0,0,0,20,"wmax",null,21,21,21,24,25,25]
[null,null,null,null,null,null,null,null,null,"wmin",null,14,12,10,11,14,14]
["kion",null,23,9,24,null,null,null,null,"heinen",9.6,20.5,null,13.6,34.4]
[]
[null,45029.454606481479]
[null,11]
[null,"2023-04-13"]
[1,2,3,4,5,6,7,8,9,10,11,12,13,14,15,16,17,18,19,null,19,20,21,22,23,24,25,26,27,null,28,29,null,30,31,32,33,34,35,36,null,37,38,39,40,41,42]
[null,"[{\"publishingOffice\":\"京都地方気象台\",\"reportDatetime\":\"2023-04-13T11:00:00+09:00\",\"timeSeries\":[{\"timeDefines\":[\"2023-04-13T11:00:00+09:00\",\"2023-04-14T00:00:00+09:00\",\"2023-04-15T00:00:00+09:00\"],\"areas\":[{\"area\":{\"name\":\"南部\",\"code\":\"260010\"},\"weatherCodes\":[\"100\",\"111\",\"302\"],\"weathers\":[\"晴れ\",\"晴れ　夕方　から　くもり\",\"雨　時々　くもり\"],\"winds\":[\"南の風\",\"東の風　後　西の風\",\"南東の風　後　南西の風\"]},{\"area\":{\"name\":\"北部\",\"code\":\"260020\"},\"weatherCodes\":[\"100\",\"111\",\"302\"],\"weathers\":[\"晴れ\",\"晴れ　夕方　から　くもり\",\"雨　時々　くもり\"],\"winds\":[\"南西の風　後　南の風\",\"南の風　日中　北の風\",\"南東の風　後　西の風\"],\"waves\":[\"１メートル\",\"１メートル　後　０．５メートル\",\"１メートル　後　２メートル\"]}]},{\"timeDefines\":[\"2023-04-13T12:00:00+09:00\",\"2023-04-13T18:00:00+09:00\",\"2023-04-14T00:00:00+09:00\",\"2023-04-14T06:00:00+09:00\",\"2023-04-14T12:00:00+09:00\",\"2023-04-14T18:00:00+09:00\"],\"areas\":[{\"area\":{\"name\":\"南部\",\"code\":\"260010\"},\"pops\":[\"0\",\"0\",\"0\",\"0\",\"0\",\"20\"]},{\"area\":{\"name\":\"北部\",\"code\":\"260020\"},\"pops\":[\"0\",\"0\",\"0\",\"0\",\"0\",\"20\"]}]},{\"timeDefines\":[\"2023-04-13T09:00:00+09:00\",\"2023-04-13T00:00:00+09:00\",\"2023-04-14T00:00:00+09:00\",\"2023-04-14T09:00:00+09:00\"],\"areas\":[{\"area\":{\"name\":\"京都\",\"code\":\"61286\"},\"temps\":[\"23\",\"23\",\"9\",\"24\"]},{\"area\":{\"name\":\"舞鶴\",\"code\":\"61111\"},\"temps\":[\"22\",\"22\",\"10\",\"25\"]}]}]},{\"publishingOffice\":\"京都地方気象台\",\"reportDatetime\":\"2023-04-13T11:00:00+09:00\",\"timeSeries\":[{\"timeDefines\":[\"2023-04-14T00:00:00+09:00\",\"2023-04-15T00:00:00+09:00\",\"2023-04-16T00:00:00+09:00\",\"2023-04-17T00:00:00+09:00\",\"2023-04-18T00:00:00+09:00\",\"2023-04-19T00:00:00+09:00\",\"2023-04-20T00:00:00+09:00\"],\"areas\":[{\"area\":{\"name\":\"京都府\",\"code\":\"260000\"},\"weatherCodes\":[\"111\",\"302\",\"201\",\"101\",\"201\",\"200\",\"201\"],\"pops\":[\"\",\"90\",\"30\",\"20\",\"30\",\"40\",\"30\"],\"reliabilities\":[\"\",\"\",\"B\",\"A\",\"A\",\"B\",\"B\"]}]},{\"timeDefines\":[\"2023-04-14T00:00:00+09:00\",\"2023-04-15T00:00:00+09:00\",\"2023-04-16T00:00:00+09:00\",\"2023-04-17T00:00:00+09:00\",\"2023-04-18T00:00:00+09:00\",\"2023-04-19T00:00:00+09:00\",\"2023-04-20T00:00:00+09:00\"],\"areas\":[{\"area\":{\"name\":\"京都\",\"code\":\"61286\"},\"tempsMin\":[\"\",\"14\",\"12\",\"10\",\"11\",\"14\",\"14\"],\"tempsMinUpper\":[\"\",\"15\",\"13\",\"11\",\"15\",\"16\",\"17\"],\"tempsMinLower\":[\"\",\"12\",\"11\",\"9\",\"8\",\"10\",\"9\"],\"tempsMax\":[\"\",\"21\",\"21\",\"21\",\"24\",\"25\",\"25\"],\"tempsMaxUpper\":[\"\",\"24\",\"23\",\"23\",\"27\",\"29\",\"29\"],\"tempsMaxLower\":[\"\",\"20\",\"18\",\"18\",\"20\",\"22\",\"22\"]}]}],\"tempAverage\":{\"areas\":[{\"area\":{\"name\":\"京都\",\"code\":\"61286\"},\"min\":\"9.6\",\"max\":\"20.5\"}]},\"precipAverage\":{\"areas\":[{\"area\":{\"name\":\"京都\",\"code\":\"61286\"},\"min\":\"13.6\",\"max\":\"34.4\"}]}}]"]
[]
[]
[]
[]
[]
[null,2,3,4,5,6,7,8,9,10,11,12]
[null,"アメダスデータ設定データ"]
[null,"↓コンボボックス値",null,null,"↓マクロ使用値",null,null,"↓コンボボックス値",null,null,"↓マクロ使用値","↓マクロ使用値"]
[null,1,"アメダス","地点コード",{"$f":"RIGHT(\"0\" & TEXT(VLOOKUP(気象情報!B10,天気データ!C31:D35,2,FALSE),\"@\"),4)","v":"0596"},2,"年",4,"月","記入開始行",{"$f":"VLOOKUP(気象情報!E10,天気データ!I31:J42,2,FALSE)","v":100},{"$f":"IF(気象情報!E10=\"01\",352,VLOOKUP(VALUE(気象情報!E10)-1,天気データ!H31:J42,3,FALSE))","v":68}]
{"$rows_left_out":13}
{"sheet":"園部2023","index":4,"n_rows":382,"n_cols":16,"rows_kept":382,"cut":false,"hidden":false,"merged":[]}
[]
[]
[]
[]
["1月"]
[1,0,0,0,3,10.7,-2.2999999999999998,76,40,1.5,5,"西南西",10.4,"西","西南西",5.4]
[2,1,1,0.5,2,6.8,-2,91,74,1.1000000000000001,3.7,"北西",7.5,"西","西",0.7]
[3,0,0,0,1.5,9.5,-3,84,49,1.4,5.8,"西北西",9.1999999999999993,"西","西北西",5.3]
[4,1,1,0.5,1.6,7.9,-4.2,84,50,2,5.9,"西北西",10.4,"西北西","西北西",2.2000000000000002]
[5,0.5,0.5,0.5,2.2000000000000002,7.2,-2,87,63,1.5,5.0999999999999996,"西北西",8.1,"西北西","北西",4.5]
[6,0,0,0,2.5,9.3000000000000007,-2.4,84,49,1.1000000000000001,3.8,"西北西",6.9,"西","西",3.1]
[7,0.5,0.5,0.5,1.2,5.5,-2.5,95,78,0.6,1.7,"西",2.6,"西北西","西南西",1]
[8,0,0,0,3.4,10.7,-0.7,87,56,1.4,5.5,"北西",8.8000000000000007,"北西","西北西",2.6]
[9,0.5,0.5,0.5,4.0999999999999996,12.5,-2.2000000000000002,84,42,1.1000000000000001,4.9000000000000004,"西北西",10.199999999999999,"西北西","西",5.0999999999999996]
[10,1,0.5,0.5,3.5,7.2,-2.1,72,52,3,6.2,"北西",11.9,"西北西","西北西",5.5]
[11,0,0,0,0.8,11.8,-5.4,78,35,1.1000000000000001,2.5,"西北西",3.6,"東北東","西",9]
[12,0,0,0,2.7,14.7,-5.0999999999999996,81,47,0.9,2.5,"東",4.3,"東","西南西",9.1999999999999993]
[13,7,2.5,1,6.9,15.8,-1.7,89,62,1.3,3.9,"南南東",9.5,"南","西",0.1]
[14,6,2,0.5,11.4,14.3,9.3000000000000007,93,83,1.5,4.7,"西北西",7.7,"北西","西北西",0]
[15,0.5,0.5,0.5,9.1,11.5,4.4000000000000004,85,70,1.6,3.5,"西北西",6.6,"西北西","西北西",0]
[16,0,0,0,5.5,8.4,1.7,84,68,2.7,6.4,"西北西",11.7,"西北西","西北西",1]
[17,0,0,0,3,8.1,-1.5,77,48,1.4,3.1,"東",4.9000000000000004,"東","西北西",2.6]
[18,0,0,0,2,8.9,-3.1,86,57,1.5,4.9000000000000004,"西北西",8.6999999999999993,"西北西","西北西",3.9]
[19,0,0,0,2.2999999999999998,9.8000000000000007,-2.5,81,45,1.1000000000000001,2.7,"東南東",3.8,"東南東","西",3.4]
[20,0,0,0,2.7,11.6,-4.0999999999999996,76,39,2.2000000000000002,7.6,"西",11.8,"西","北西",7]
[21,0,0,0,1.4,5.9,-3.6,82,57,2.5,5.9,"西北西",9,"西","西",4.4000000000000004]
[22,0,0,0,1.5,9.1999999999999993,-5,79,47,1.2,3.6,"西北西",6.2,"西北西","西北西",5]
[23,1,0.5,0.5,3.1,6.9,1.1000000000000001,90,74,1.1000000000000001,3.5,"北西",6.9,"西北西","西北西",0]
[24,16,4,1,0.7,6.4,-4.3,86,43,3,10.1,"西北西",17.2,"西北西","西北西",1.2]
[25,8,1.5,1,-3.3,-0.3,-7.9,87,70,2.2000000000000002,5.6,"西",9.1,"西南西","西北西",0.5]
{"$rows_left_out":353}
{"sheet":"園部2022","index":5,"n_rows":382,"n_cols":30,"rows_kept":382,"cut":false,"hidden":false,"merged":[[1,16,1,17],[1,0,3,0],[1,1,1,3],[1,4,1,6],[1,7,1,8],[1,9,1,14]]}
[null,null,null,null,null,null,null,null,null,10,null,null,null,null,null,null,null,null,null,20,21,22,23,24,25,26,27,28,29,30]
["日","降水量(mm)",null,null,"気温(℃)",null,null,"湿度(％)",null,"風向・風速(m/s)",null,null,null,null,null,"日照\n時間\n(h)","雪(cm)"]
[null,"合計","最大",null,"平均","最高","最低","平均","最小","平均","最大風速",null,"最大瞬間風速",null,"最多\n風向",null,"降雪深","最深積雪"]
[null,null,"1時間","10分間",null,null,null,null,null,"風速","風速","風向","風速","風向",null,null,"計","値"]
["１月"]
[1,2,1,0.5,0,2.5,-4.3,null,null,1.6,3.7,"西北西",6.4,"西","西北西",0]
[2,0,0,0,-0.1,7.8,-3.7,null,null,0.7,2.4,"西北西",3.3,"西北西","西北西",5.6]
[3,0,0,0,1.9,10.8,-2.5,null,null,0.9,4.5,"西南西",6.7,"西南西","西",5.9]
[4,1,0.5,0.5,1.4,4.5999999999999996,-3.3,null,null,1.4,4.0999999999999996,"西",6.5,"西","西北西",0.3]
[5,0.5,0.5,0.5,2.2999999999999998,5.5,0.4,null,null,2,5.0999999999999996,"北西",9.1999999999999993,"北北西","西北西",3.2]
[6,0,0,0,2.2999999999999998,8.1,-0.1,null,null,0.6,2.5,"北北西",4.8,"北北西","西北西",4.0999999999999996]
[7,1,1,0.5,2.5,6.7,-0.7,null,null,2,5.4,"西北西",10.3,"北北西","西北西",2.9]
[8,0,0,0,1.9,9.6999999999999993,-2.9,null,null,0.9,3.3,"東南東",5.7,"東南東","西",7.6]
[9,0,0,0,2.9,11.5,-4.3,null,null,0.9,3.7,"西",6.2,"西北西","西北西",6.3]
[10,0,0,0,4.7,12.5,-1.6,null,null,1,4,"西",6.5,"西","西",9.1]
[11,6,2,0.5,2,6.1,-2.2999999999999998,null,null,1,4.5999999999999996,"西北西",8.5,"西","西北西",0.4]
[12,3,0.5,0.5,1,3.1,-0.2,null,null,1.7,5.2,"西北西",8.8000000000000007,"西","西北西",0]
[13,0,0.5,0,1.3,6.1,-1.7,null,null,2.8,8.8000000000000007,"西",14.9,"西","西北西",8.1999999999999993]
[14,7.5,3,1,-0.2,1.5,-1.7,null,null,1.7,4.3,"西",8.3000000000000007,"西","西",0]
[15,0,0,0,1,7.2,-3.1,null,null,1.1000000000000001,3.2,"西北西",5.9,"西","西",5.6]
[16,0,0,0,1.1000000000000001,10.1,-2.4,null,null,1,4.2,"西南西",7.4,"西","西南西",5.2]
[17,0,0,0,2.4,9.1999999999999993,-1.5,null,null,1.8,5.3,"西南西",8.6,"西","西北西",4.2]
[18,0.5,0.5,0.5,0.6,3.6,-1.8,null,null,2,4.7,"西北西",10.199999999999999,"西","西北西",1.2]
[19,0.5,0.5,0.5,0.3,5.4,-2.6,null,null,0.9,4.5,"北西",7.2,"北西","西",2.5]
[20,6.5,2,1,-0.1,3.6,-2.6,null,null,2.6,6.8,"西北西",11.5,"西北西","西",2.8]
[21,1.5,2,0.5,0.2,2.5,-3.5,null,null,2.5,5.0999999999999996,"西",8.6,"西","西北西",0.7]
[22,0,0,0,1.4,6.7,-2.5,null,null,1.5,3.8,"西北西",6,"西北西","西北西",1.8]
[23,10,2.5,0.5,-0.1,2.1,-3.4,null,null,0.2,1.4,"西北西",2,"北西","西北西",0]
[24,0,0,0,4.0999999999999996,6.8,0.9,null,null,2.4,4.5,"西北西",10.1,"北北西","西北西",0]
[25,0,0,0,3.1,8.9,-1.4,null,null,1.1000000000000001,3.6,"北西",5.8,"西北西","西",4.5]
{"$rows_left_out":353}
{"sheet":"須知2023","index":6,"n_rows":98,"n_cols":4,"rows_kept":98,"cut":false,"hidden":false,"merged":[]}
[]
[]
[]
[]
["1月"]
[1,0,0,0]
[2,1.5,0.5,0.5]
[3,0,0,0]
[4,3,1.5,0.5]
[5,0.5,0.5,0.5]
[6,0,0,0]
[7,0,0,0]
[8,0,0,0]
[9,1.5,1,0.5]
[10,1,0.5,0.5]
[11,0,0,0]
[12,0,0,0]
[13,8.5,2.5,1]
[14,6.5,2,0.5]
[15,0,0,0]
[16,2,1,0.5]
[17,0,0,0]
[18,0,0,0]
[19,0,0,0]
[20,0,0,0]
[21,0,0,0]
[22,0,0,0]
[23,2,1,0.5]
[24,11.5,3.5,1]
[25,11,1.5,1]
{"$rows_left_out":69}
{"sheet":"須知2022","index":7,"n_rows":382,"n_cols":4,"rows_kept":382,"cut":false,"hidden":false,"merged":[]}
[]
[]
[]
[]
["1月"]
[1,4,1,0.5]
[2,0,0,0]
[3,0,0,0]
[4,2.5,0.5,0.5]
[5,0.5,1,0.5]
[6,0,0,0]
[7,1.5,1,0.5]
[8,0,0,0]
[9,0,0,0]
[10,0,0,0]
[11,7.5,2.5,1]
[12,6,1.5,1]
[13,1.5,1.5,0.5]
[14,14,5.5,1.5]
[15,0,0,0]
[16,0,0,0]
[17,0,0,0]
[18,2,0.5,0.5]
[19,0.5,0.5,0.5]
[20,7,1.5,1]
[21,1.5,1,0.5]
[22,0,0,0]
[23,9.5,2,0.5]
[24,1,0.5,0.5]
[25,0,0,0]
{"$rows_left_out":353}
{"sheet":"本庄2023","index":8,"n_rows":98,"n_cols":4,"rows_kept":98,"cut":false,"hidden":false,"merged":[]}
[]
[]
[]
[]
["1月"]
[1,0,0,0]
[2,5,2.5,0.5]
[3,0,0,0]
[4,4.5,1.5,1]
[5,2,1,0.5]
[6,0,0,0]
[7,0,0,0]
[8,1,0.5,0.5]
[9,4,2.5,0.5]
[10,2.5,1,0.5]
[11,0,0,0]
[12,0,0,0]
[13,12,3.5,1]
[14,8.5,3,1]
[15,0.5,0.5,0.5]
[16,6.5,1.5,0.5]
[17,0,0,0]
[18,0,0,0]
[19,0,0,0]
[20,0.5,0.5,0.5]
[21,1.5,1,0.5]
[22,0,0,0]
[23,2,0.5,0.5]
[24,17.5,4.5,1.5]
[25,15,2.5,1]
{"$rows_left_out":69}
{"sheet":"本庄2022","index":9,"n_rows":382,"n_cols":4,"rows_kept":382,"cut":false,"hidden":false,"merged":[]}
[]
[]
[]
[]
["1月"]
[1,6,2,1]
[2,0.5,0.5,0.5]
[3,2,1.5,0.5]
[4,10.5,2.5,1]
[5,1.5,1.5,0.5]
[6,0,0,0]
[7,2,1.5,0.5]
[8,0,0,0]
[9,0,0,0]
[10,0,0,0]
[11,7.5,2,0.5]
[12,12,3.5,1.5]
[13,5,4,1.5]
[14,21,5.5,1.5]
[15,0,0,0]
[16,0,0,0]
[17,0.5,0.5,0.5]
[18,7,1,0.5]
[19,1.5,0.5,0.5]
[20,14.5,2.5,1]
[21,4,1.5,0.5]
[22,0,0,0]
[23,7,1.5,0.5]
[24,1.5,0.5,0.5]
[25,0,0,0]
{"$rows_left_out":353}
{"sheet":"美山2023","index":10,"n_rows":98,"n_cols":18,"rows_kept":98,"cut":false,"hidden":false,"merged":[]}
[]
[]
[]
[]
["1月"]
[1,0,0,0,3.5,11.1,-0.8,75,41,1,4.2,"西南西",9.6,"西","西南西",3.8,0,0]
[2,1,1,0.5,2.6,6.5,-0.2,90,73,0.9,3.1,"西南西",5.6,"西南西","西南西",0.7,0,0]
[3,1.5,0.5,0.5,2.4,6.8,-0.4,89,58,1.2,4.2,"北北西",8.6999999999999993,"西","北東",2.4,0,0]
[4,6,1.5,1,1.7,5.5,-0.1,93,71,1,3.2,"北北東",6,"西","北北東",0.6,0,0]
[5,3,1,0.5,2.2000000000000002,6.7,0.3,91,67,1,4.4000000000000004,"南西",7.5,"西南西","北東",2.2999999999999998,0,0]
[6,0.5,0.5,0.5,3.3,6.9,1.3,89,64,1.1000000000000001,2.6,"北東",5.0999999999999996,"北北東","北北東",0.2,0,0]
[7,0,0,0,2.9,8.6,-0.4,89,56,1,3.3,"西南西",6,"西南西","北北東",1.9,0,0]
[8,0.5,0.5,0.5,4.7,10.199999999999999,1.9,86,58,1.2,4,"西南西",8,"南西","西南西",5,0,0]
[9,3,2,1,4.5999999999999996,11.3,0.3,86,50,1.3,4.5,"北東",8.1999999999999993,"北東","北東",5.2,0,0]
[10,4.5,1.5,0.5,2.9,6.1,-1.8,77,55,1.4,4.5999999999999996,"北東",8.4,"北北東","西",2.2000000000000002,0,0]
[11,0,0,0,1.4,11.5,-2.2999999999999998,82,35,1.2,3.7,"北東",4.8,"北北東","北東",8.6,0,0]
[12,0,0,0,2.7,15.1,-3.3,83,38,1.5,3.4,"北東",5.2,"北東","北東",8.6,0,0]
[13,12.5,4,1,7.2,15.4,-0.6,87,63,1.9,4.4000000000000004,"南西",9.6999999999999993,"南","北東",0.6,0,0]
[14,9.5,2.5,0.5,11.1,13.5,9.6999999999999993,95,86,0.9,2.8,"東北東",6.1,"北北東","東北東",0,0,0]
[15,1,0.5,0.5,8.3000000000000007,10.1,6.1,90,78,1.2,3.2,"北東",6.1,"東北東","東",0,0,0]
[16,15.5,3,1,4.9000000000000004,7.6,1.4,89,72,1.6,4.5,"北東",10.5,"北東","東北東",0,0,0]
[17,0,0,0,2.8,7.8,0.4,83,53,1.2,3.6,"北東",6.2,"東南東","東北東",3.7,0,0]
[18,0,0,0,2.9,8.1999999999999993,-0.4,86,59,1.1000000000000001,3.7,"西",9.5,"西","北東",1.2,0,0]
[19,0,0,0,3.4,8.9,-0.3,82,48,1,3.2,"北北東",4.8,"北東","東北東",3.5,0,0]
[20,1,0.5,0.5,3.4,10.7,-0.6,76,40,1.7,4.8,"南西",9.8000000000000007,"南西","西南西",5.6,0,0]
[21,3.5,1,0.5,1.1000000000000001,4.9000000000000004,-0.9,86,57,1.2,4.5999999999999996,"北東",9.9,"北東","北東",3.9,3,3]
[22,0,0,0,2.4,7.9,-1.1000000000000001,82,53,1.3,3.6,"北北東",5.4,"北北東","北東",3.8,0,0]
[23,2,1,0.5,3.1,6.8,0.7,90,75,1,3.1,"南西",6.8,"南南西","北東",1.3,0,0]
[24,21.5,5.5,1.5,0.3,5.4,-4.8,88,49,1.8,9.1,"西南西",17.899999999999999,"西","西",0.6,22,22]
[25,11.5,1.5,0.5,-3.5,-0.3,-5.8,87,69,1.3,3.5,"西南西",7.3,"西南西","西",0.7,11,31]
{"$rows_left_out":69}
{"sheet":"美山2022","index":11,"n_rows":382,"n_cols":18,"rows_kept":382,"cut":false,"hidden":false,"merged":[]}
[]
[]
[]
[]
["1月"]
[1,4,1.5,0.5,-0.2,1.6,-2.2000000000000002,null,null,0.7,2.1,"西",5.0999999999999996,"西","東北東",0,4,36]
[2,1,1,0.5,0.1,5.3,-2.1,null,null,0.7,1.9,"東北東",2.7,"東北東","東北東",6.4,1,27]
[3,1,0.5,0.5,1,6.9,-1.2,null,null,0.8,2.5,"北北東",4.2,"北東","北東",7,2,18]
[4,10.5,1.5,0.5,0.5,3.8,-1.2,null,null,0.6,2.9,"西北西",4.9000000000000004,"西北西","東北東",0.1,5,13]
[5,3.5,1.5,0.5,0.5,3.3,-0.4,null,null,0.6,3.5,"北東",6.9,"北東","東北東",0.8,4,10]
[6,0,0,0,0.8,6.3,-0.9,null,null,0.6,2.2999999999999998,"南南西",3.4,"北北東","南西",4.4000000000000004,3,8]
[7,3.5,1.5,0.5,1.5,4.7,-0.3,null,null,1.1000000000000001,3.3,"西南西",7.1,"西北西","西",0.7,0,6]
[8,0,0,0,1.3,8.3000000000000007,-1.7,null,null,0.5,2.2999999999999998,"北東",3.5,"北東","東北東",6.8,0,4]
[9,0,0,0,1.4,7.4,-2.7,null,null,1,3.7,"北東",4.9000000000000004,"北東","東北東",5.8,0,0]
[10,0,0,0,2.1,10,-2.2000000000000002,null,null,1.2,4.3,"北北東",7.8,"北北東","東北東",8.3000000000000007,0,0]
[11,9.5,3,1,1.1000000000000001,4.4000000000000004,-2.2999999999999998,null,null,0.8,3.9,"西南西",9.6,"西","東北東",0,0,0]
[12,10.5,2.5,1,-0.1,1.3,-1,null,null,0.8,2.6,"西北西",7.7,"西","西",0,15,14]
[13,3,2.5,1,0.1,3.2,-2.5,null,null,1.9,6.5,"西南西",12.2,"西南西","西南西",4.8,12,8]
[14,21.5,4,1.5,-0.6,1.8,-2,null,null,1.2,3.4,"西",7,"西","西北西",0.2,29,29]
[15,0,0,0,0.5,5.3,-1.1000000000000001,null,null,0.6,2.4,"北北東",3.2,"北東","北東",3,2,25]
[16,0,0,0,0.9,7.7,-1.7,null,null,0.8,2.7,"南南西",6,"南","東北東",6,0,13]
[17,2.5,2,0.5,1.4,7.3,-1.1000000000000001,null,null,1.1000000000000001,5.0999999999999996,"西南西",10.1,"西","西南西",3.2,11,11]
[18,9.5,2.5,1,-0.6,1.9,-4.2,null,null,0.8,3.1,"西北西",7.1,"西","西",0.1,19,22]
[19,0,0,0,-0.7,3.9,-4.9000000000000004,null,null,0.5,2.7,"西南西",4.9000000000000004,"西","西南西",2.6,2,17]
[20,13.5,3,1,-0.4,2.2000000000000002,-2.1,null,null,0.9,4.7,"西",9.1999999999999993,"西","南西",0.5,17,20]
[21,11.5,2,1,-0.6,1.7,-1.6,null,null,1,3.8,"北東",7.7,"北東","西",0.2,14,32]
[22,0,0,0,-0.2,3.3,-1.5,null,null,0.5,2.6,"北北東",5.7,"北東","東北東",0.1,1,25]
[23,8,2,0.5,-0.4,0.9,-1.9,null,null,1.2,3.2,"北北東",5,"北","北北東",0,2,17]
[24,5,2,0.5,2.2000000000000002,4.5999999999999996,0,null,null,1.1000000000000001,3.3,"北東",11,"東北東","北東",0,5,16]
[25,0,0,0,1.7,6.4,-2.1,null,null,1.1000000000000001,3.8,"北北東",5.6,"北","北東",3.9,4,11]
{"$rows_left_out":353}
{"sheet":"三和2023","index":12,"n_rows":98,"n_cols":4,"rows_kept":98,"cut":false,"hidden":false,"merged":[]}
[]
[]
[]
[]
["1月"]
[1,0,0,0]
[2,2,1.5,1]
[3,0,0,0]
[4,1.5,1,0.5]
[5,1,0.5,0.5]
[6,0,0,0]
[7,0,0,0]
[8,0,0,0]
[9,3,1.5,1]
[10,2.5,1.5,0.5]
[11,0,0,0]
[12,0,0,0]
[13,5.5,2,1]
[14,6.5,2.5,0.5]
[15,2.5,1,0.5]
[16,10.5,2.5,0.5]
[17,0,0,0]
[18,0,0,0]
[19,0,0,0]
[20,0,0,0]
[21,0,0,0]
[22,0,0,0]
[23,1,0.5,0.5]
[24,19,5,1.5]
[25,16,3,1]
{"$rows_left_out":69}
{"sheet":"三和2022","index":13,"n_rows":382,"n_cols":4,"rows_kept":382,"cut":false,"hidden":false,"merged":[]}
[]
[]
[]
[]
["1月"]
[1,3,1,0.5]
[2,0,0,0]
[3,0,0,0]
[4,5,1,0.5]
[5,0.5,0.5,0.5]
[6,0,0,0]
[7,1.5,1.5,0.5]
[8,0,0,0]
[9,0,0,0]
[10,0,0,0]
[11,4.5,1.5,0.5]
[12,5.5,1,0.5]
[13,1.5,1.5,1]
[14,10,3,1]
[15,0,0,0]
[16,0,0,0]
[17,0,0,0]
[18,3.5,1,0.5]
[19,0.5,0.5,0.5]
[20,12,3,1]
[21,3.5,1,0.5]
[22,0,0,0]
[23,7,2,0.5]
[24,1.5,0.5,0.5]
[25,0,0,0]
{"$rows_left_out":352}